Target
Bcl-2-like protein 1
Ligand
BDBM50394837
Substrate
Meas. Tech.
ChEMBL_1896442 (CHEMBL4398477)
Ki
0.900000±n/a nM
Citation
 Yang, SMao, YZhang, HXu, YAn, JHuang, Z The chemical biology of apoptosis: Revisited after 17 years. Eur J Med Chem 177:63-75 (2019)  
Target
Name:
Bcl-2-like protein 1
Synonyms:
Anti-apoptotic Bcl-2 protein Apoptosis regulator Bcl-X BCL2-like 1 isoform 1 BCL2L1 Bcl-2-like protein 1 (Bcl-XL) Bcl-xL/Bcl-2-binding component 3 Bcl2-antagonist of cell death (BAD)
Type:
Mitochondrion membrane; Single-pass membrane protein
Mol. Mass.:
26039.60
Organism:
Homo sapiens (Human)
Description:
Residue:
233
  
Inhibitor
Name:
BDBM50394837
Synonyms:
CHEMBL343002 | HOE-33342
Type:
Small organic molecule
Emp. Form.:
C27H28N6O
Mol. Mass.:
452.5508
SMILES:
CCOc1ccc(cc1)-c1nc2ccc(cc2[nH]1)-c1nc2ccc(cc2[nH]1)N1CCN(C)CC1
: