Target
17-beta-hydroxysteroid dehydrogenase type 2
Ligand
BDBM50525964
Substrate
Meas. Tech.
ChEMBL_1898526 (CHEMBL4400641)
IC50
0.400000±n/a nM
Citation
 Abdelsamie, ASHerath, SBiskupek, YBörger, CSiebenbürger, LSalah, MScheuer, CMarchais-Oberwinkler, SFrotscher, MPohlemann, TMenger, MDHartmann, RWLaschke, MWvan Koppen, CJ Targeted Endocrine Therapy: Design, Synthesis, and Proof-of-Principle of 17?-Hydroxysteroid Dehydrogenase Type 2 Inhibitors in Bone Fracture Healing. J Med Chem 62:1362-1372 (2019)  
Target
Name:
17-beta-hydroxysteroid dehydrogenase type 2
Synonyms:
17-beta-Hydroxysteroid Dehydrogenase 2 (17-beta-HSD2) 20-alpha-HSD EDH17B2 Estradiol 17-beta-dehydrogenase 2 (17beta-HSD2) Microsomal 17-beta-hydroxysteroid dehydrogenas Testosterone 17-beta-dehydrogenase
Type:
Oxidoreductase; single-pass type II membrane protein
Mol. Mass.:
42795.29
Organism:
Homo sapiens (Human)
Description:
Enzyme was partially purified from human placenta.
Residue:
387
  
Inhibitor
Name:
BDBM50525964
Synonyms:
CHEMBL4546082
Type:
Small organic molecule
Emp. Form.:
C23H13ClF3NO4S2
Mol. Mass.:
523.932
SMILES:
Oc1c(F)c(F)cc(C(=O)c2ccc(s2)-c2cccc(NS(=O)(=O)c3ccc(Cl)cc3)c2)c1F
: