Target
Peroxisome proliferator-activated receptor alpha
Ligand
BDBM28699
Substrate
Meas. Tech.
ChEMBL_153377 (CHEMBL763564)
EC50
55000±n/a nM
Citation
 Brown, PJWinegar, DAPlunket, KDMoore, LBLewis, MCWilson, JGSundseth, SSKoble, CSWu, ZChapman, JMLehmann, JMKliewer, SAWillson, TM A ureido-thioisobutyric acid (GW9578) is a subtype-selective PPARalpha agonist with potent lipid-lowering activity. J Med Chem 42:3785-8 (1999)  
Target
Name:
Peroxisome proliferator-activated receptor alpha
Synonyms:
NR1C1 PPAR PPAR-alpha PPARA_HUMAN Peroxisome proliferator-activated receptor | Peroxisome proliferator-activated receptor alpha (PPAR alpha)
Type:
Enzyme
Mol. Mass.:
52222.08
Organism:
Homo sapiens (Human)
Description:
Q07869
Residue:
468
  
Inhibitor
Name:
BDBM28699
Synonyms:
2-(4-chlorophenoxy)-2-methylpropanoic acid Clofibrate clofibric acid
Type:
Small organic molecule
Emp. Form.:
C10H11ClO3
Mol. Mass.:
214.646
SMILES:
CC(C)(Oc1ccc(Cl)cc1)C(O)=O
: