Target
Stromelysin-1
Ligand
BDBM50063917
Substrate
Meas. Tech.
ChEBML_101945
IC50
200±n/a nM
Citation
 Martin, FMBeckett, RPBellamy, CLCourtney, PFDavies, SJDrummond, AHDodd, RPratt, LMPatel, SRRicketts, MLTodd, RSTuffnell, ARWard, JWWhittaker, M The synthesis and biological evaluation of non-peptidic matrix metalloproteinase inhibitors. Bioorg Med Chem Lett 9:2887-92 (1999)  
Target
Name:
Stromelysin-1
Synonyms:
MMP-3 MMP3_HUMAN Matrix metalloproteinase 3 Matrix metalloproteinase-3 (MMP-3) SL-1 Stromelysin 1 | Transin-1
Type:
Enzyme
Mol. Mass.:
53973.13
Organism:
Homo sapiens (Human)
Description:
P08254
Residue:
477
  
Inhibitor
Name:
BDBM50063917
Synonyms:
(2S,3R)-N(4)-[(2S)-3,3-dimethyl-1-(methylamino)-1-oxobutan-2-yl]-N(1),2-dihydroxy-3-(2-methylpropyl)butanediamide cid_119031 | marimastat
Type:
Small organic molecule
Emp. Form.:
C15H29N3O5
Mol. Mass.:
331.4079
SMILES:
CNC(=O)[C@@H](NC(=O)[C@H](CC(C)C)[C@H](O)C(=O)NO)C(C)(C)C
: