Target
Proteasome subunit beta type-9
Ligand
BDBM50526813
Substrate
Meas. Tech.
ChEMBL_1901160 (CHEMBL4403382)
IC50
425±n/a nM
Citation
 Xi, JZhuang, RKong, LHe, RZhu, HZhang, J Immunoproteasome-selective inhibitors: An overview of recent developments as potential drugs for hematologic malignancies and autoimmune diseases. Eur J Med Chem 182:0 (2019)  
Target
Name:
Proteasome subunit beta type-9
Synonyms:
LMP2 Macropain chain 7 PSB9_HUMAN PSMB9 Proteasome subunit beta-1i Really interesting new gene 12 protein
Type:
PROTEIN
Mol. Mass.:
23256.49
Organism:
Homo sapiens (Human)
Description:
ChEMBL_106197
Residue:
219
  
Inhibitor
Name:
BDBM50526813
Synonyms:
CHEMBL4465456
Type:
Small organic molecule
Emp. Form.:
C35H48N4O5
Mol. Mass.:
604.7794
SMILES:
CC(C)C[C@H](NC(=O)CN1CCCCCC1)C(=O)N[C@@H](Cc1ccccc1)C(=O)N[C@@H](Cc1ccccc1)C(=O)[C@@]1(C)CO1
: