Target
Proteasome subunit beta type-9
Ligand
BDBM50526812
Substrate
Meas. Tech.
ChEMBL_1901160 (CHEMBL4403382)
IC50
1850±n/a nM
Citation
 Xi, JZhuang, RKong, LHe, RZhu, HZhang, J Immunoproteasome-selective inhibitors: An overview of recent developments as potential drugs for hematologic malignancies and autoimmune diseases. Eur J Med Chem 182:0 (2019)  
Target
Name:
Proteasome subunit beta type-9
Synonyms:
LMP2 Macropain chain 7 PSB9_HUMAN PSMB9 Proteasome subunit beta-1i Really interesting new gene 12 protein
Type:
PROTEIN
Mol. Mass.:
23256.49
Organism:
Homo sapiens (Human)
Description:
ChEMBL_106197
Residue:
219
  
Inhibitor
Name:
BDBM50526812
Synonyms:
CHEMBL4441524
Type:
Small organic molecule
Emp. Form.:
C31H43N3O7
Mol. Mass.:
569.689
SMILES:
COc1ccc(C[C@H](NC(=O)[C@@H](C)NC(=O)[C@H]2CC[C@H](O)CC2)C(=O)N[C@@H](CC2=CCCC2)C(=O)[C@@]2(C)CO2)cc1
: