Target
Mu-type opioid receptor
Ligand
BDBM50526892
Substrate
Meas. Tech.
ChEMBL_1901658 (CHEMBL4403880)
Ki
84±n/a nM
Citation
 Stefanucci, ADimmito, MPMacedonio, GCiarlo, LPieretti, SNovellino, ELei, WBarlow, DHouseknecht, KLStreicher, JMMollica, A Potent, Efficacious, and Stable Cyclic Opioid Peptides with Long Lasting Antinociceptive Effect after Peripheral Administration. J Med Chem 63:2673-2687 (2020)  
Target
Name:
Mu-type opioid receptor
Synonyms:
M-OR-1 MOR-1 MUOR1 Mu opiate receptor OPRM1 hMOP | mu-type opioid receptor isoform MOR-1
Type:
G Protein-Coupled Receptor (GPCR)
Mol. Mass.:
44789.51
Organism:
Homo sapiens (Human)
Description:
P35372
Residue:
400
  
Inhibitor
Name:
BDBM50526892
Synonyms:
CHEMBL4551481
Type:
Small organic molecule
Emp. Form.:
C54H60F8N10O14S2
Mol. Mass.:
1289.23
SMILES:
OC(=O)C(F)(F)F.OC(=O)C(F)(F)F.N[C@@H](Cc1ccc(O)cc1)C(=O)N[C@@H]1CSSC[C@@H](NC(=O)[C@@H](N)Cc2ccc(O)cc2)C(=O)NCC(=O)N[C@@H](Cc2ccc(F)cc2)C(=O)N2CCN(CC2)C(=O)[C@H](Cc2ccc(F)cc2)NC(=O)CNC1=O
: