Target
Aldehyde dehydrogenase family 1 member A3
Ligand
BDBM50527786
Substrate
Meas. Tech.
ChEMBL_1903542 (CHEMBL4405764)
IC50
22800±n/a nM
Citation
 Quattrini, LGelardi, ELMCoviello, VSartini, SFerraris, DMMori, MNakano, IGaravaglia, SLa Motta, C Imidazo[1,2- J Med Chem 63:4603-4616 (2020)  
Target
Name:
Aldehyde dehydrogenase family 1 member A3
Synonyms:
AL1A3_HUMAN ALDH6 Aldehyde dehydrogenase family 1 member A3 RalDH3 | Retinaldehyde dehydrogenase 3
Type:
PROTEIN
Mol. Mass.:
56110.85
Organism:
Homo sapiens (Human)
Description:
ChEMBL_109700
Residue:
512
  
Inhibitor
Name:
BDBM50527786
Synonyms:
CHEMBL4440588
Type:
Small organic molecule
Emp. Form.:
C19H13FN2
Mol. Mass.:
288.3183
SMILES:
Fc1ccc(cc1)-c1ccc2nc(cn2c1)-c1ccccc1
: