Target
Aldehyde dehydrogenase family 1 member A3
Ligand
BDBM50527794
Substrate
Meas. Tech.
ChEMBL_1903542 (CHEMBL4405764)
IC50
92900±n/a nM
Citation
 Quattrini, LGelardi, ELMCoviello, VSartini, SFerraris, DMMori, MNakano, IGaravaglia, SLa Motta, C Imidazo[1,2- J Med Chem 63:4603-4616 (2020)  
Target
Name:
Aldehyde dehydrogenase family 1 member A3
Synonyms:
AL1A3_HUMAN ALDH6 Aldehyde dehydrogenase family 1 member A3 RalDH3 | Retinaldehyde dehydrogenase 3
Type:
PROTEIN
Mol. Mass.:
56110.85
Organism:
Homo sapiens (Human)
Description:
ChEMBL_109700
Residue:
512
  
Inhibitor
Name:
BDBM50527794
Synonyms:
CHEMBL4463367
Type:
Small organic molecule
Emp. Form.:
C20H15FN2
Mol. Mass.:
302.3449
SMILES:
Cc1ccc(cc1)-c1cn2cc(ccc2n1)-c1ccc(F)cc1
: