Target
Cytochrome P450 4F2
Ligand
BDBM50527962
Substrate
Meas. Tech.
ChEMBL_1904207 (CHEMBL4406429)
IC50
1130000±n/a nM
Citation
 Kowalski, JPMcDonald, MGPelletier, RDHanenberg, HWiek, CRettie, AE Design and Characterization of the First Selective and Potent Mechanism-Based Inhibitor of Cytochrome P450 4Z1. J Med Chem 63:4824-4836 (2020)  
Target
Name:
Cytochrome P450 4F2
Synonyms:
20-HETE synthase Arachidonic acid omega-hydroxylase CYP4F2 Cytochrome P450 4F2 Leukotriene-B(4) 20-monooxygenase 1 Phylloquinone omega-hydroxylase CYP4F2
Type:
PROTEIN
Mol. Mass.:
59859.32
Organism:
Homo sapiens (Human)
Description:
ChEMBL_10743
Residue:
520
  
Inhibitor
Name:
BDBM50527962
Synonyms:
CHEMBL4442292
Type:
Small organic molecule
Emp. Form.:
C12H16N4O2
Mol. Mass.:
248.281
SMILES:
OC(=O)CCCCCNn1nnc2ccccc12
: