Target
D(3) dopamine receptor
Ligand
BDBM50400511
Substrate
Meas. Tech.
ChEMBL_1904307 (CHEMBL4406529)
Ki
5.6±n/a nM
Citation
 Moritz, AEFree, RBWeiner, WSAkano, EOGandhi, DAbramyan, AKeck, TMFerrer, MHu, XSouthall, NSteiner, JAubé, JShi, LFrankowski, KJSibley, DR Discovery, Optimization, and Characterization of ML417: A Novel and Highly Selective D J Med Chem 63:5526-5567 (2020)  
Target
Name:
D(3) dopamine receptor
Synonyms:
DOPAMINE D3 DRD3_HUMAN Dopamine D3 receptor (D3) Dopamine receptor Dopamine receptor D3
Type:
Mol. Mass.:
44243.43
Organism:
Homo sapiens (Human)
Description:
Residue:
400
  
Inhibitor
Name:
BDBM50400511
Synonyms:
CHEMBL2203406
Type:
Small organic molecule
Emp. Form.:
C27H34N4O2S
Mol. Mass.:
478.649
SMILES:
CCCN(CC[C@]1(O)C[C@@H](C1)NC(=O)c1ccc2ccccc2c1)[C@H]1CCc2nc(N)sc2C1
: