Target
Disintegrin and metalloproteinase domain-containing protein 17
Ligand
BDBM50082939
Substrate
Meas. Tech.
ChEMBL_212750 (CHEMBL820592)
IC50
0.63±n/a nM
Citation
 Barlaam, BBird, TGLambert-Van Der Brempt, CCampbell, DFoster, SJMaciewicz, R New alpha-substituted succinate-based hydroxamic acids as TNFalpha convertase inhibitors. J Med Chem 42:4890-908 (1999)  
Target
Name:
Disintegrin and metalloproteinase domain-containing protein 17
Synonyms:
ADA17_HUMAN CSVP Disintegrin and metalloproteinase domain-containing protein 17 (ADAM17) TNF-alpha convertase TNF-alpha-converting enzyme (TACE) Tumor necrosis factor-α converting enzyme (TACE)
Type:
Enzyme
Mol. Mass.:
93007.89
Organism:
Homo sapiens (Human)
Description:
Residue:
824
  
Inhibitor
Name:
BDBM50082939
Synonyms:
(2S,3S)-2-(4-Cyano-phenylsulfanyl)-N*4*-((S)-2,2-dimethyl-1-methylcarbamoyl-propyl)-N*1*-hydroxy-3-isobutyl-succinamide | CHEMBL342069
Type:
Small organic molecule
Emp. Form.:
C22H32N4O4S
Mol. Mass.:
448.579
SMILES:
CNC(=O)[C@@H](NC(=O)[C@H](CC(C)C)[C@H](Sc1ccc(cc1)C#N)C(=O)NO)C(C)(C)C
: