Target
Neutrophil collagenase
Ligand
BDBM50082965
Substrate
Meas. Tech.
ChEMBL_105067 (CHEMBL711313)
IC50
0.2±n/a nM
Citation
 Barlaam, BBird, TGLambert-Van Der Brempt, CCampbell, DFoster, SJMaciewicz, R New alpha-substituted succinate-based hydroxamic acids as TNFalpha convertase inhibitors. J Med Chem 42:4890-908 (1999)  
Target
Name:
Neutrophil collagenase
Synonyms:
CLG1 MMP8 Matrix metalloproteinase-8 PMNL collagenase | PMNL-CL
Type:
Enzyme
Mol. Mass.:
53413.48
Organism:
Homo sapiens (Human)
Description:
P22894
Residue:
467
  
Inhibitor
Name:
BDBM50082965
Synonyms:
(2R,3S)-N*1*-((S)-2,2-Dimethyl-1-methylcarbamoyl-propyl)-N*4*-hydroxy-2-isobutyl-3-[(quinolin-8-ylmethyl)-amino]-succinamide | CHEMBL439983
Type:
Small organic molecule
Emp. Form.:
C25H37N5O4
Mol. Mass.:
471.5924
SMILES:
CNC(=O)[C@@H](NC(=O)[C@H](CC(C)C)[C@H](NCc1cccc2cccnc12)C(=O)NO)C(C)(C)C
: