Target
Kynurenine 3-monooxygenase
Ligand
BDBM50083954
Substrate
Meas. Tech.
ChEMBL_91745 (CHEMBL700046)
IC50
1900±n/a nM
Citation
 Drysdale, MJHind, SLJansen, MReinhard, JF Synthesis and SAR of 4-aryl-2-hydroxy-4-oxobut-2-enoic acids and esters and 2-amino-4-aryl-4-oxobut-2-enoic acids and esters: potent inhibitors of kynurenine-3-hydroxylase as potential neuroprotective agents. J Med Chem 43:123-7 (2000)  
Target
Name:
Kynurenine 3-monooxygenase
Synonyms:
KMO_RAT | Kmo
Type:
PROTEIN
Mol. Mass.:
54371.88
Organism:
Rattus norvegicus
Description:
ChEMBL_1487468
Residue:
478
  
Inhibitor
Name:
BDBM50083954
Synonyms:
4-(3,4-Dichloro-phenyl)-2-hydroxy-4-oxo-but-2-enoic acid methyl ester | CHEMBL22481
Type:
Small organic molecule
Emp. Form.:
C11H8Cl2O4
Mol. Mass.:
275.085
SMILES:
COC(=O)C(=O)CC(=O)c1ccc(Cl)c(Cl)c1
: