Target
Proteasome subunit beta type-9
Ligand
BDBM50007203
Substrate
Meas. Tech.
ChEMBL_1909303 (CHEMBL4411749)
IC50
287±n/a nM
Citation
 Johnson, HWBLowe, EAnderl, JLFan, AMuchamuel, TBowers, SMoebius, DCKirk, CMcMinn, DL Required Immunoproteasome Subunit Inhibition Profile for Anti-Inflammatory Efficacy and Clinical Candidate KZR-616 ((2 S,3 R)- N-(( S)-3-(Cyclopent-1-en-1-yl)-1-(( R)-2-methyloxiran-2-yl)-1-oxopropan-2-yl)-3-hydroxy-3-(4-methoxyphenyl)-2-(( S)-2-(2-morpholinoacetamido)propanamido)propenamide). J Med Chem 61:11127-11143 (2018)  
Target
Name:
Proteasome subunit beta type-9
Synonyms:
LMP2 Macropain chain 7 PSB9_HUMAN PSMB9 Proteasome subunit beta-1i Really interesting new gene 12 protein
Type:
PROTEIN
Mol. Mass.:
23256.49
Organism:
Homo sapiens (Human)
Description:
ChEMBL_106197
Residue:
219
  
Inhibitor
Name:
BDBM50007203
Synonyms:
CHEMBL3237875
Type:
Small organic molecule
Emp. Form.:
C31H40N4O7
Mol. Mass.:
580.6719
SMILES:
COc1ccc(C[C@H](NC(=O)[C@H](C)NC(=O)CN2CCOCC2)C(=O)N[C@@H](Cc2ccccc2)C(=O)[C@@]2(C)CO2)cc1
: