Target
Carbonic anhydrase 9
Ligand
BDBM50200941
Substrate
Meas. Tech.
ChEMBL_1921829 (CHEMBL4424674)
Ki
250±n/a nM
Citation
 Andring, JTDohle, WTu, CPotter, BVLMcKenna, R 3,17?-Bis-sulfamoyloxy-2-methoxyestra-1,3,5(10)-triene and Nonsteroidal Sulfamate Derivatives Inhibit Carbonic Anhydrase IX: Structure-Activity Optimization for Isoform Selectivity. J Med Chem 62:2202-2212 (2019)  
Target
Name:
Carbonic anhydrase 9
Synonyms:
CA-IX CAH9_HUMAN Carbonic anhydrase 9 (CA IX) Carbonic anhydrase 9 precursor Carbonic anhydrase IX (CAIX) Carbonic anhydrases; II & IX MN RCC-associated antigen G250
Type:
Enzyme
Mol. Mass.:
49669.03
Organism:
Homo sapiens (Human)
Description:
Catalytic domain of human cloned isozyme was used in the assay
Residue:
459
  
Inhibitor
Name:
BDBM50200941
Synonyms:
(9BETA,13ALPHA,14BETA,17ALPHA)-2-ETHYLESTRA-1(10),2,4-TRIENE-3,17-DIYL DISULFAMATE 2-ethylestradiol-3,17-O,O-bis-sulfamate | CHEMBL425287
Type:
Small organic molecule
Emp. Form.:
C20H30N2O6S2
Mol. Mass.:
458.592
SMILES:
CCc1cc2[C@H]3CC[C@]4(C)[C@H](CC[C@H]4[C@@H]3CCc2cc1OS(N)(=O)=O)OS(N)(=O)=O
: