Target
Cholinesterase
Ligand
BDBM50532207
Substrate
Meas. Tech.
ChEMBL_1922072 (CHEMBL4424917)
IC50
0.170000±n/a nM
Citation
 de Andrade, PMantoani, SPGonçalves Nunes, PSMagadán, CRPérez, CXavier, DJHojo, ETSCampillo, NEMartínez, ACarvalho, I Highly potent and selective aryl-1,2,3-triazolyl benzylpiperidine inhibitors toward butyrylcholinesterase in Alzheimer's disease. Bioorg Med Chem 27:931-943 (2019)  
Target
Name:
Cholinesterase
Synonyms:
Acylcholine acylhydrolase Butyrylcholine esterase (BChE) Butyrylcholinesterase (BuChE) CHLE_HUMAN Cholinesterases Pseudocholinesterase
Type:
Homotetramer
Mol. Mass.:
68422.27
Organism:
Homo sapiens (Human)
Description:
P06276
Residue:
602
  
Inhibitor
Name:
BDBM50532207
Synonyms:
CHEMBL4464964
Type:
Small organic molecule
Emp. Form.:
C26H32N6O2
Mol. Mass.:
460.5713
SMILES:
CC(=O)N[C@@H](Cn1cc(nn1)-c1ccccc1)C(=O)NCC1CCN(Cc2ccccc2)CC1
: