Target
Acyl-protein thioesterase 1
Ligand
BDBM119784
Substrate
Meas. Tech.
ChEMBL_1928057 (CHEMBL4431129)
IC50
9920±n/a nM
Citation
 Pissarnitski, DAZhao, ZCole, DWu, WLDomalski, MClader, JWScapin, GVoigt, JSoriano, AKelly, TPowles, MAYao, ZBurnett, DA Scaffold-hopping from xanthines to tricyclic guanines: A case study of dipeptidyl peptidase 4 (DPP4) inhibitors. Bioorg Med Chem 24:5534-5545 (2016)  
Target
Name:
Acyl-protein thioesterase 1
Synonyms:
Acyl-protein thioesterase 1/2 LYPA1_RAT Lysosomal phospholipase A1
Type:
PROTEIN
Mol. Mass.:
24708.49
Organism:
Rattus norvegicus
Description:
ChEMBL_12731
Residue:
230
  
Inhibitor
Name:
BDBM119784
Synonyms:
US8691832, 3
Type:
Small organic molecule
Emp. Form.:
C29H29F2N9O
Mol. Mass.:
557.5971
SMILES:
Cc1nc(CN2C3=NCCN3c3nc(N4CCC[C@@H](N)C4)n(Cc4cc(F)ccc4F)c3C2=O)nc2ccccc12
: