Target
Acyl-protein thioesterase 1
Ligand
BDBM119788
Substrate
Meas. Tech.
ChEMBL_1928057 (CHEMBL4431129)
IC50
755±n/a nM
Citation
 Pissarnitski, DAZhao, ZCole, DWu, WLDomalski, MClader, JWScapin, GVoigt, JSoriano, AKelly, TPowles, MAYao, ZBurnett, DA Scaffold-hopping from xanthines to tricyclic guanines: A case study of dipeptidyl peptidase 4 (DPP4) inhibitors. Bioorg Med Chem 24:5534-5545 (2016)  
Target
Name:
Acyl-protein thioesterase 1
Synonyms:
Acyl-protein thioesterase 1/2 LYPA1_RAT Lysosomal phospholipase A1
Type:
PROTEIN
Mol. Mass.:
24708.49
Organism:
Rattus norvegicus
Description:
ChEMBL_12731
Residue:
230
  
Inhibitor
Name:
BDBM119788
Synonyms:
US8691832, 7
Type:
Small organic molecule
Emp. Form.:
C27H33N9O
Mol. Mass.:
499.6106
SMILES:
[#6]\[#6](-[#6])=[#6]\[#6]-n1c(nc2-[#7]-3-[#6]-[#6]-[#7]=[#6]-3-[#7](-[#6]-c3nc(-[#6])c4ccccc4n3)-[#6](=O)-c12)-[#7]-1-[#6]-[#6]-[#6]-[#6@@H](-[#7])-[#6]-1
: