Target
Acyl-protein thioesterase 1
Ligand
BDBM119791
Substrate
Meas. Tech.
ChEMBL_1928057 (CHEMBL4431129)
IC50
3122±n/a nM
Citation
 Pissarnitski, DAZhao, ZCole, DWu, WLDomalski, MClader, JWScapin, GVoigt, JSoriano, AKelly, TPowles, MAYao, ZBurnett, DA Scaffold-hopping from xanthines to tricyclic guanines: A case study of dipeptidyl peptidase 4 (DPP4) inhibitors. Bioorg Med Chem 24:5534-5545 (2016)  
Target
Name:
Acyl-protein thioesterase 1
Synonyms:
Acyl-protein thioesterase 1/2 LYPA1_RAT Lysosomal phospholipase A1
Type:
PROTEIN
Mol. Mass.:
24708.49
Organism:
Rattus norvegicus
Description:
ChEMBL_12731
Residue:
230
  
Inhibitor
Name:
BDBM119791
Synonyms:
US8691832, 10
Type:
Small organic molecule
Emp. Form.:
C26H31N9O
Mol. Mass.:
485.584
SMILES:
Cc1nc(CN2C3=NCCN3c3nc(N4CCC[C@@H](N)C4)n(CC4CC4)c3C2=O)nc2ccccc12
: