Target
Dipeptidyl peptidase 4
Ligand
BDBM50225074
Substrate
Meas. Tech.
ChEMBL_1928893 (CHEMBL4432069)
Kd
0.300000±n/a nM
Citation
 Schnapp, GKlein, THoevels, YBakker, RANar, H Comparative Analysis of Binding Kinetics and Thermodynamics of Dipeptidyl Peptidase-4 Inhibitors and Their Relationship to Structure. J Med Chem 59:7466-77 (2016)  
Target
Name:
Dipeptidyl peptidase 4
Synonyms:
ADABP Adenosine deaminase complexing protein 2 CD_antigen=CD26 DPP4 DPPIV Dipeptidyl peptidase 4 (DPP IV) Dipeptidyl peptidase 4 (DPP4) Dipeptidyl peptidase 4 membrane form Dipeptidyl peptidase IV Dipeptidyl peptidase IV (DDP-IV) Dipeptidyl peptidase IV membrane form Dipeptidyl peptidase-IV (DPP-4) T-cell activation antigen CD26 | TP103
Type:
Enzyme
Mol. Mass.:
88271.01
Organism:
Homo sapiens (Human)
Description:
P27487
Residue:
766
  
Inhibitor
Name:
BDBM50225074
Synonyms:
(1S,3S,5S)-2-[(S)-2-amino-2-(3-hydroxy-adamantan-1-yl)-acetyl]-2-aza-bicyclo[3.1.0]hexane-3-carbonitrile BMS-477118 SAXAGLIPTIN
Type:
Small organic molecule
Emp. Form.:
C18H25N3O2
Mol. Mass.:
315.41
SMILES:
N[C@H](C(=O)N1[C@H]2C[C@H]2C[C@H]1C#N)C12CC3CC(CC(O)(C3)C1)C2
: