Target
Cannabinoid receptor 1
Ligand
BDBM50534487
Substrate
Meas. Tech.
ChEMBL_1929056 (CHEMBL4432232)
Ki
52±n/a nM
Citation
 Seltzman, HHShiner, CHirt, EEGilliam, AFThomas, BFMaitra, RSnyder, RBlack, SLPatel, PRMulpuri, YSpigelman, I Peripherally Selective Cannabinoid 1 Receptor (CB1R) Agonists for the Treatment of Neuropathic Pain. J Med Chem 59:7525-43 (2016)  
Target
Name:
Cannabinoid receptor 1
Synonyms:
CANN6 CB-R CNR CNR1_HUMAN Cannabinoid receptor Cannabinoid receptor 1 (brain)
Type:
G Protein-Coupled Receptor (GPCR)
Mol. Mass.:
52868.96
Organism:
Homo sapiens (Human)
Description:
P21554
Residue:
472
  
Inhibitor
Name:
BDBM50534487
Synonyms:
CHEMBL4459965
Type:
Small organic molecule
Emp. Form.:
C27H26N2O4
Mol. Mass.:
442.5063
SMILES:
COC(=O)c1ccc(C(=O)c2cn(CCN3CCOCC3)c3ccccc23)c2ccccc12
: