Target
Cannabinoid receptor 1
Ligand
BDBM50534464
Substrate
Meas. Tech.
ChEMBL_1929056 (CHEMBL4432232)
Ki
0.859000±n/a nM
Citation
 Seltzman, HHShiner, CHirt, EEGilliam, AFThomas, BFMaitra, RSnyder, RBlack, SLPatel, PRMulpuri, YSpigelman, I Peripherally Selective Cannabinoid 1 Receptor (CB1R) Agonists for the Treatment of Neuropathic Pain. J Med Chem 59:7525-43 (2016)  
Target
Name:
Cannabinoid receptor 1
Synonyms:
CANN6 CB-R CNR CNR1_HUMAN Cannabinoid receptor Cannabinoid receptor 1 (brain)
Type:
G Protein-Coupled Receptor (GPCR)
Mol. Mass.:
52868.96
Organism:
Homo sapiens (Human)
Description:
P21554
Residue:
472
  
Inhibitor
Name:
BDBM50534464
Synonyms:
CHEMBL4483714
Type:
Small organic molecule
Emp. Form.:
C28H29NO
Mol. Mass.:
395.536
SMILES:
CCc1ccc(\C=C2/C=C(CCN3CCOCC3)c3ccccc23)c2ccccc12
: