Target
Cytochrome P450 2C9
Ligand
BDBM50090664
Substrate
Meas. Tech.
ChEMBL_51549 (CHEMBL661223)
Ki
1500±n/a nM
Citation
 Rao, SAoyama, RSchrag, MTrager, WFRettie, AJones, JP A refined 3-dimensional QSAR of cytochrome P450 2C9: computational predictions of drug interactions. J Med Chem 43:2789-96 (2000)  
Target
Name:
Cytochrome P450 2C9
Synonyms:
(R)-limonene 6-monooxygenase CP2C9_HUMAN CYP2C9 Cytochrome P450 2C9 (CYP2C9 ) P-450MP P450 PB-1 | S-mephenytoin 4-hydroxylase
Type:
Enzyme
Mol. Mass.:
55636.33
Organism:
Homo sapiens (Human)
Description:
P11712
Residue:
490
  
Inhibitor
Name:
BDBM50090664
Synonyms:
6-Ethynyl-4-hydroxy-3-(2-oxo-1-phenyl-propyl)-chromen-2-one | CHEMBL94358
Type:
Small organic molecule
Emp. Form.:
C20H14O4
Mol. Mass.:
318.3228
SMILES:
CC(=O)C(c1ccccc1)c1c(O)c2cc(ccc2oc1=O)C#C
: