Target
Leucine-rich repeat serine/threonine-protein kinase 2
Ligand
BDBM50535648
Substrate
Meas. Tech.
ChEMBL_1931008 (CHEMBL4434259)
IC50
1.000000±n/a nM
Citation
 Abdel-Magid, AF LRRK2 Kinase Inhibitors as Possible Therapy for Parkinson's Disease and Other Neurodegenerative Disorders. ACS Med Chem Lett 10:846-847 (2019)  
Target
Name:
Leucine-rich repeat serine/threonine-protein kinase 2
Synonyms:
Dardarin LRRK2_HUMAN Leucine-rich repeat serine/threonine-protein kinase 2 PARK8
Type:
Protein
Mol. Mass.:
286113.20
Organism:
Homo sapiens (Human)
Description:
Q5S007
Residue:
2527
  
Inhibitor
Name:
BDBM50535648
Synonyms:
CHEMBL4450014
Type:
Small organic molecule
Emp. Form.:
C26H29N7O
Mol. Mass.:
455.5548
SMILES:
C[C@H]1CN(CCN1C1COC1)c1cc(ncn1)-n1ncc2ccc(cc12)C1(CC2(CC2)C1)C#N
: