Target
D(2) dopamine receptor
Ligand
BDBM50542261
Substrate
Meas. Tech.
ChEMBL_1986381 (CHEMBL4619928)
IC50
1.0±n/a nM
Citation
 Shi, WWang, YWu, CYang, FZheng, WWu, SLiu, YWang, ZHe, YShen, J Synthesis and biological investigation of triazolopyridinone derivatives as potential multireceptor atypical antipsychotics. Bioorg Med Chem Lett 30:0 (2020)  
Target
Name:
D(2) dopamine receptor
Synonyms:
D(2) dopamine receptor DOPAMINE D2 Long DRD2 Dopamine D2 receptor Dopamine D2 receptor (D2R) Dopamine2-like | d2
Type:
Cell-surface receptors
Mol. Mass.:
50647.10
Organism:
Homo sapiens (Human)
Description:
P14416
Residue:
443
  
Inhibitor
Name:
BDBM50542261
Synonyms:
CHEMBL4644391
Type:
Small organic molecule
Emp. Form.:
C23H24N6OS
Mol. Mass.:
432.541
SMILES:
O=c1n(CCCCN2CCN(CC2)c2cccc3sccc23)nc2ccc(cn12)C#N
: