Target
Serine/threonine-protein kinase LMTK3
Ligand
BDBM50542351
Substrate
Meas. Tech.
ChEMBL_1986602 (CHEMBL4620149)
IC50
210±n/a nM
Citation
 Ortiz, MAMichaels, HMolina, BToenjes, SDavis, JMarconi, GDHecht, DGustafson, JLPiedrafita, FJNefzi, A Discovery of cyclic guanidine-linked sulfonamides as inhibitors of LMTK3 kinase. Bioorg Med Chem Lett 30:0 (2020)  
Target
Name:
Serine/threonine-protein kinase LMTK3
Synonyms:
2.7.11.1 LMTK3 Lemur tyrosine kinase 3 TYKLM3
Type:
PROTEIN
Mol. Mass.:
153597.90
Organism:
Homo sapiens
Description:
ChEMBL_119182
Residue:
1460
  
Inhibitor
Name:
BDBM50542351
Synonyms:
CHEMBL4637017
Type:
Small organic molecule
Emp. Form.:
C22H29ClN4O3S
Mol. Mass.:
465.009
SMILES:
CC(C)C[C@H]1CNC(=N)N1C[C@H](Cc1ccc(O)cc1)NS(=O)(=O)c1ccccc1Cl
: