Target
Beta-lactamase
Ligand
BDBM50099195
Substrate
Meas. Tech.
ChEBML_35530
IC50
100000±n/a nM
Citation
 Sandanayaka, VPFeigelson, GBPrashad, ASYang, YPetersen, PJ Allyl and propargyl substituted penam sulfones as versatile intermediates toward the syntheses of new beta-lactamase inhibitors. Bioorg Med Chem Lett 11:997-1000 (2001)  
Target
Name:
Beta-lactamase
Synonyms:
AMPC_ECOLI Beta-lactamase (AmpC) Cephalosporinase ampA | ampC
Type:
Protien
Mol. Mass.:
41561.62
Organism:
Escherichia coli
Description:
P00811
Residue:
377
  
Inhibitor
Name:
BDBM50099195
Synonyms:
(2S,5R)-3,3-Dimethyl-4,4,7-trioxo-6-((E)-4-oxo-pent-2-enyl)-4lambda*6*-thia-1-aza-bicyclo[3.2.0]heptane-2-carboxylic acid | CHEMBL6301
Type:
Small organic molecule
Emp. Form.:
C13H17NO6S
Mol. Mass.:
315.342
SMILES:
CC(=O)CC=CC1[C@@H]2N([C@@H](C(O)=O)C(C)(C)S2(=O)=O)C1=O
: