Target
Poly [ADP-ribose] polymerase 1
Ligand
BDBM50106187
Substrate
Meas. Tech.
ChEMBL_151871 (CHEMBL763795)
IC50
22000±n/a nM
Citation
 Costantino, GMacchiarulo, ACamaioni, EPellicciari, R Modeling of poly(ADP-ribose)polymerase (PARP) inhibitors. Docking of ligands and quantitative structure-activity relationship analysis. J Med Chem 44:3786-94 (2001)  
Target
Name:
Poly [ADP-ribose] polymerase 1
Synonyms:
(ARTD1 or PARP1) 2.4.2.30 ADPRT ARTD1 Human diphtheria toxin-like ADP-ribosyltransferase (ARTD1 or PARP1) NT-PARP-1 PARP1 PPOL Poly [ADP-ribose] polymerase 1 (PARP) Poly [ADP-ribose] polymerase 1 (PARP1) Poly [ADP-ribose] polymerase 1, 28-kDa form Poly [ADP-ribose] polymerase 1, processed C-terminus Poly [ADP-ribose] polymerase-1 Poly(ADP-ribose) polymerase-1 (ARTD1/PARP1) Protein poly-ADP-ribosyltransferase PARP1 | Synonyms=ADPRT
Type:
Mol. Mass.:
113114.22
Organism:
Homo sapiens (Human)
Description:
P09874
Residue:
1014
  
Inhibitor
Name:
BDBM50106187
Synonyms:
Benzenecarboxamide Benzoylamide Phenylcarboxamide benzamide
Type:
Small organic molecule
Emp. Form.:
C7H7NO
Mol. Mass.:
121.1366
SMILES:
NC(=O)c1ccccc1
: