Target
Prothrombin
Ligand
BDBM50102780
Substrate
Meas. Tech.
ChEMBL_225572 (CHEMBL847929)
Ki
320±n/a nM
Citation
 Mackman, RLKatz, BABreitenbucher, JGHui, HCVerner, ELuong, CLiu, LSprengeler, PA Exploiting subsite S1 of trypsin-like serine proteases for selectivity: potent and selective inhibitors of urokinase-type plasminogen activator. J Med Chem 44:3856-71 (2001)  
Target
Name:
Prothrombin
Synonyms:
Activation peptide fragment 1 Coagulation factor II Prothrombin precursor Thrombin heavy chain | Thrombin light chain
Type:
Protein
Mol. Mass.:
70029.57
Organism:
Homo sapiens (Human)
Description:
P00734
Residue:
622
  
Inhibitor
Name:
BDBM50102780
Synonyms:
2-(2-Hydroxy-3-phenyl-phenyl)-1H-indole-5-carboxamidine 3-{5-[AMINO(IMINIO)METHYL]-1H-INDOL-2-YL}-1,1'-BIPHENYL-2-OLATE | CHEMBL96433
Type:
Small organic molecule
Emp. Form.:
C21H17N3O
Mol. Mass.:
327.3792
SMILES:
NC(=N)c1ccc2[nH]c(cc2c1)-c1cccc(-c2ccccc2)c1O
: