Target
Sigma non-opioid intracellular receptor 1
Ligand
BDBM50064946
Substrate
Meas. Tech.
ChEMBL_223691 (CHEMBL846101)
Ki
14.34±n/a nM
Citation
 Huang, YHammond, PSWu, LMach, RH Synthesis and structure-activity relationships of N-(1-benzylpiperidin-4-yl)arylacetamide analogues as potent sigma1 receptor ligands. J Med Chem 44:4404-15 (2001)  
Target
Name:
Sigma non-opioid intracellular receptor 1
Synonyms:
Aging-associated gene 8 protein SGMR1_HUMAN SIGMAR1 SR31747-binding protein Sigma 1-type opioid receptor Sigma1R | hSigmaR1
Type:
Enzyme Catalytic Domain
Mol. Mass.:
25124.85
Organism:
Homo sapiens (Human)
Description:
Q99720
Residue:
223
  
Inhibitor
Name:
BDBM50064946
Synonyms:
4-(4-Chloro-phenyl)-1-[4-(4-fluoro-phenyl)-4-hydroxy-butyl]-piperidin-4-ol Hydroxyhaloperidol
Type:
Small organic molecule
Emp. Form.:
C21H25ClFNO2
Mol. Mass.:
377.88
SMILES:
OC(CCCN1CCC(O)(CC1)c1ccc(Cl)cc1)c1ccc(F)cc1
: