Target
Cruzipain
Ligand
BDBM50108874
Substrate
Meas. Tech.
ChEMBL_51847 (CHEMBL664070)
Ki
4.8±n/a nM
Citation
 Huang, LLee, AEllman, JA Identification of potent and selective mechanism-based inhibitors of the cysteine protease cruzain using solid-phase parallel synthesis. J Med Chem 45:676-84 (2002)  
Target
Name:
Cruzipain
Synonyms:
CYSP_TRYCR Cruzaine | Major cysteine proteinase
Type:
Protein
Mol. Mass.:
49831.41
Organism:
Trypanosoma cruzi
Description:
P25779
Residue:
467
  
Inhibitor
Name:
BDBM50108874
Synonyms:
CHEMBL351045 | [1-(1-Benzyl-3-tert-butylsulfanyl-2-oxo-propylcarbamoyl)-3-methyl-butyl]-carbamic acid pyridin-3-ylmethyl ester
Type:
Small organic molecule
Emp. Form.:
C27H37N3O4S
Mol. Mass.:
499.665
SMILES:
CC(C)C[C@H](NC(=O)OCc1cccnc1)C(=O)N[C@@H](Cc1ccccc1)C(=O)CSC(C)(C)C
: