Target
Adenosine receptor A2b
Ligand
BDBM50113247
Substrate
Meas. Tech.
ChEMBL_30739 (CHEMBL649770)
Ki
5530±n/a nM
Citation
 Kim, SAMarshall, MAMelman, NKim, HSMüller, CELinden, JJacobson, KA Structure-activity relationships at human and rat A2B adenosine receptors of xanthine derivatives substituted at the 1-, 3-, 7-, and 8-positions. J Med Chem 45:2131-8 (2002)  
Target
Name:
Adenosine receptor A2b
Synonyms:
AA2BR_RAT Adora2b
Type:
PROTEIN
Mol. Mass.:
36378.84
Organism:
Rattus norvegicus
Description:
ChEMBL_32934
Residue:
332
  
Inhibitor
Name:
BDBM50113247
Synonyms:
3-Methyl-1-phenethyl-3,7-dihydro-purine-2,6-dione | CHEMBL67228
Type:
Small organic molecule
Emp. Form.:
C14H14N4O2
Mol. Mass.:
270.2866
SMILES:
Cn1c2nc[nH]c2c(=O)n(CCc2ccccc2)c1=O
: