Target
D(2) dopamine receptor
Ligand
BDBM50116767
Substrate
Meas. Tech.
ChEMBL_61941 (CHEMBL675129)
EC50
47±n/a nM
Citation
 Löber, SHübner, HGmeiner, P Fused azaindole derivatives: molecular design, synthesis and in vitro pharmacology leading to the preferential dopamine D3 receptor agonist FAUC 725. Bioorg Med Chem Lett 12:2377-80 (2002)  
Target
Name:
D(2) dopamine receptor
Synonyms:
DOPAMINE D2 DOPAMINE D2 Short Dopamine D2 receptor Drd2
Type:
G Protein-Coupled Receptor (GPCR)
Mol. Mass.:
50931.60
Organism:
Rattus norvegicus (rat)
Description:
P61169
Residue:
444
  
Inhibitor
Name:
BDBM50116767
Synonyms:
CHEMBL310867 | Dipropyl-(S)-1,2,3,4-tetrahydro-pyrido[1,2-b]indazol-2-yl-amine
Type:
Small organic molecule
Emp. Form.:
C17H25N3
Mol. Mass.:
271.4005
SMILES:
CCCN(CCC)[C@H]1CCc2nn3ccccc3c2C1
: