Target
Cannabinoid receptor 1
Ligand
BDBM50117256
Substrate
Meas. Tech.
ChEMBL_46810 (CHEMBL659696)
Ki
>1000±n/a nM
Citation
 van der Stelt, Mvan Kuik, JABari, Mvan Zadelhoff, GLeeflang, BRVeldink, GAFinazzi-Agrò, AVliegenthart, JFMaccarrone, M Oxygenated metabolites of anandamide and 2-arachidonoylglycerol: conformational analysis and interaction with cannabinoid receptors, membrane transporter, and fatty acid amide hydrolase. J Med Chem 45:3709-20 (2002)  
Target
Name:
Cannabinoid receptor 1
Synonyms:
Brain-type cannabinoid receptor CB-R CNR1_RAT Cannabinoid receptor Cnr1 | Skr6
Type:
G Protein-Coupled Receptor (GPCR)
Mol. Mass.:
52856.55
Organism:
Rattus norvegicus (rat)
Description:
P20272
Residue:
473
  
Inhibitor
Name:
BDBM50117256
Synonyms:
15-Hydroxy-icosa-5,8,11,13-tetraenoic acid 2,3-dihydroxy-propyl ester | CHEMBL122195
Type:
Small organic molecule
Emp. Form.:
C23H38O5
Mol. Mass.:
394.5448
SMILES:
CCCCC[C@H](O)\C=C\C=C/C\C=C/C\C=C/CCCC(=O)OC[C@@H](O)CO
: