Target
Vascular cell adhesion protein 1
Ligand
BDBM50007260
Substrate
Meas. Tech.
ChEBML_213820
IC50
>50000±n/a nM
Citation
 Meng, CQSomers, PKRachita, CLHolt, LAHoong, LKZheng, XSSimpson, JEHill, RROlliff, LKKunsch, CSundell, CLParthasarathy, SSaxena, USikorski, JAWasserman, MA Novel phenolic antioxidants as multifunctional inhibitors of inducible VCAM-1 expression for use in atherosclerosis. Bioorg Med Chem Lett 12:2545-8 (2002)  
Target
Name:
Vascular cell adhesion protein 1
Synonyms:
CD106 antigen VCAM-1 VCAM1_HUMAN Vascular cell adhesion protein 1 (VCAM-1) | Vascular cell adhesion protein 1 precursor
Type:
Other Protein Type
Mol. Mass.:
81259.16
Organism:
Homo sapiens (Human)
Description:
P19320
Residue:
739
  
Inhibitor
Name:
BDBM50007260
Synonyms:
2,6-Di-tert-butyl-4-[1-(3,5-di-tert-butyl-4-hydroxy-phenylsulfanyl)-1-methyl-ethylsulfanyl]-phenol 2,6-di(tert-butyl)-4-{1-[3,5-di(tert-butyl)-4-hydroxyphenylsulfanyl]-1-methylethylsulfanyl}phenol(probucol) CHEMBL608 Lorelco US9182402, 14
Type:
Small organic molecule
Emp. Form.:
C31H48O2S2
Mol. Mass.:
516.842
SMILES:
CC(C)(Sc1cc(c(O)c(c1)C(C)(C)C)C(C)(C)C)Sc1cc(c(O)c(c1)C(C)(C)C)C(C)(C)C
: