Target
ATP-binding cassette sub-family C member 8/ATP-sensitive inward rectifier potassium channel 11
Ligand
BDBM50119271
Substrate
Meas. Tech.
ChEMBL_39365 (CHEMBL858103)
EC50
4000±n/a nM
Citation
 Peat, AJTownsend, CWorley, JFAllen, SHGarrido, DMertz, RJPfohl, JLTerry, CMTruax, JFVeasey, RLThomson, SA Synthesis and evaluation of 7-substituted-3-cyclobutylamino-4H-1,2,4-benzothiadiazine-1,1-dioxide derivatives as K(ATP) channel agonists. Bioorg Med Chem Lett 12:2977-80 (2002)  
Target
Name:
ATP-binding cassette sub-family C member 8/ATP-sensitive inward rectifier potassium channel 11
Synonyms:
Potassium channel, inwardly rectifying, subfamily J, member 11/Sulfonylurea receptor 1 | Sulfonylurea receptor 1, Kir6.2
Type:
Mol. Mass.:
Description:
ASSAY_ID of EBI is 39363
Components:
This complex has 2 components.
Component 1
Name:
ATP-binding cassette sub-family C member 8
Synonyms:
ABCC8 ATP-binding cassette sub-family C member 8 HRINS SUR Sulfonylurea receptor 1 | Sulfonylurea receptors
Type:
PROTEIN
Mol. Mass.:
177013.37
Organism:
Homo sapiens (Human)
Description:
ChEMBL_1436733
Residue:
1581
  
Component 2
Name:
ATP-sensitive inward rectifier potassium channel 11
Synonyms:
ATP-sensitive inward rectifier potassium channel 11 Inward rectifier K(+) channel Kir6.2 KCNJ11 Potassium channel, inwardly rectifying, subfamily J, member 11 Sulfonylurea receptor 2, Kir6.2
Type:
Enzyme Catalytic Domain
Mol. Mass.:
43549.41
Organism:
Homo sapiens (Human)
Description:
Potassium channel (ATP modulatory) 0 0::Q14654
Residue:
390
  
Component 3
Name:
ATP-binding cassette sub-family C member 8
Synonyms:
ABCC8 ATP-binding cassette sub-family C member 8 HRINS SUR Sulfonylurea receptor 1 | Sulfonylurea receptors
Type:
PROTEIN
Mol. Mass.:
177013.37
Organism:
Homo sapiens (Human)
Description:
ChEMBL_1436733
Residue:
1581
  
Inhibitor
Name:
BDBM50119271
Synonyms:
CHEMBL319521 | Cyclobutyl-(7-methoxy-1,1-dioxo-1,4-dihydro-1lambda*6*-benzo[1,2,4]thiadiazin-3-yl)-amine
Type:
Small organic molecule
Emp. Form.:
C12H15N3O3S
Mol. Mass.:
281.331
SMILES:
COc1ccc2N=C(NC3CCC3)NS(=O)(=O)c2c1
: