Target
Endothelin-1 receptor
Ligand
BDBM50119663
Substrate
Meas. Tech.
ChEBML_65490
IC50
0.320000±n/a nM
Citation
 Niiyama, KTakahashi, HNagase, TKojima, HAmano, YKatsuki, KYamakawa, TOzaki, SIhara, MYano, MFukuroda, TNishikibe, MIshikawa, K Structure-Activity relationships of 2-substituted 5,7-Diarylcyclopenteno[1,2-b]pyridine-6-carboxylic acids as a novel class of endothelin receptor antagonists. Bioorg Med Chem Lett 12:3041-5 (2002)  
Target
Name:
Endothelin-1 receptor
Synonyms:
EDNRA ET-A ETA-R Endothelin receptor type A hET-AR
Type:
Enzyme Catalytic Domain
Mol. Mass.:
48736.88
Organism:
Homo sapiens (Human)
Description:
P25101
Residue:
427
  
Inhibitor
Name:
BDBM50119663
Synonyms:
5-Benzo[1,3]dioxol-5-yl-2-isobutyl-7-(4-methoxy-phenyl)-6,7-dihydro-5H-[1]pyrindine-6-carboxylic acid | CHEMBL102314
Type:
Small organic molecule
Emp. Form.:
C27H27NO5
Mol. Mass.:
445.507
SMILES:
COc1ccc(cc1)[C@H]1[C@@H]([C@H](c2ccc(CC(C)C)nc12)c1ccc2OCOc2c1)C(O)=O
: