Target
Adenosine receptor A1
Ligand
BDBM50039676
Substrate
Meas. Tech.
ChEMBL_29727 (CHEMBL646660)
Kd
0.330±n/a nM
Citation
 Beauglehole, ARBaker, SPScammells, PJ New irreversible adenosine A(1) antagonists based on FSCPX. Bioorg Med Chem Lett 12:3179-82 (2002)  
Target
Name:
Adenosine receptor A1
Synonyms:
A1 adenosine receptor (hA1) AA1R_HUMAN ADORA1 Adenosine A1-receptor Adenosine receptor A1 (hA1) | Adenosine transporter (AdT)
Type:
G Protein-Coupled Receptor (GPCR)
Mol. Mass.:
36520.92
Organism:
Homo sapiens (Human)
Description:
P30542
Residue:
326
  
Inhibitor
Name:
BDBM50039676
Synonyms:
4-Fluorosulfonyl-benzoic acid 3-(8-cyclopentyl-2,6-dioxo-1-propyl-1,2,6,7-tetrahydro-purin-3-yl)-propyl ester CHEMBL327708
Type:
Small organic molecule
Emp. Form.:
C23H27FN4O6S
Mol. Mass.:
506.547
SMILES:
CCCn1c(=O)n(CCCOC(=O)c2ccc(cc2)S(F)(=O)=O)c2nc([nH]c2c1=O)C1CCCC1
: