Target
Thyroid hormone receptor beta
Ligand
BDBM50123060
Substrate
Meas. Tech.
ChEBML_210497
Ki
1.9±n/a nM
Citation
 Dow, RLSchneider, SRPaight, ESHank, RFChiang, PCornelius, PLee, ENewsome, WPSwick, AGSpitzer, JHargrove, DMPatterson, TAPandit, JChrunyk, BALeMotte, PKDanley, DERosner, MHAmmirati, MJSimons, SPSchulte, GKTate, BFDaSilva-Jardine, P Discovery of a novel series of 6-azauracil-based thyroid hormone receptor ligands: potent, TR beta subtype-selective thyromimetics. Bioorg Med Chem Lett 13:379-82 (2003)  
Target
Name:
Thyroid hormone receptor beta
Synonyms:
ERBA2 Nuclear receptor subfamily 1 group A member 2 THR1 c-erbA-2 | c-erbA-beta
Type:
Receptor
Mol. Mass.:
52793.62
Organism:
Homo sapiens (Human)
Description:
Recombinant hThR was obtained from nuclear extracts from SF9 cells infected with baculovirus vectors encoding for ThRbeta 1.
Residue:
461
  
Inhibitor
Name:
BDBM50123060
Synonyms:
2-{3-Chloro-4-[4-hydroxy-3-(piperidine-1-carbonyl)-phenoxy]-5-methyl-phenyl}-2H-[1,2,4]triazine-3,5-dione | CHEMBL340490
Type:
Small organic molecule
Emp. Form.:
C22H21ClN4O5
Mol. Mass.:
456.879
SMILES:
Cc1cc(cc(Cl)c1Oc1ccc(O)c(c1)C(=O)N1CCCCC1)-n1ncc(=O)[nH]c1=O
: