Target
D(2) dopamine receptor
Ligand
BDBM50123625
Substrate
Meas. Tech.
ChEMBL_59476 (CHEMBL671436)
Ki
6±n/a nM
Citation
 Venhuis, BJDijkstra, DWustrow, DJMeltzer, LTWise, LDJohnson, SJHeffner, TGWikström, HV Orally active analogues of the dopaminergic prodrug 6-(N,N-di-n-propylamino)-3,4,5,6,7,8-hexahydro-2H-naphthalen-1-one: synthesis and pharmacological activity. J Med Chem 46:584-90 (2003)  
Target
Name:
D(2) dopamine receptor
Synonyms:
DOPAMINE D2 DRD2_BOVIN | Dopamine D2 receptor
Type:
Enzyme Catalytic Domain
Mol. Mass.:
50698.79
Organism:
BOVINE
Description:
P20288
Residue:
444
  
Inhibitor
Name:
BDBM50123625
Synonyms:
(S)-6-[Propyl-(2-thiophen-2-yl-ethyl)-amino]-5,6,7,8-tetrahydro-naphthalene-1,2-diol | CHEMBL155613
Type:
Small organic molecule
Emp. Form.:
C19H25NO2S
Mol. Mass.:
331.472
SMILES:
CCCN(CCc1cccs1)[C@H]1CCc2c(C1)ccc(O)c2O
: