Target
Sodium-dependent dopamine transporter
Ligand
BDBM50062912
Substrate
Meas. Tech.
ChEMBL_61355 (CHEMBL673257)
IC50
17±n/a nM
Citation
 Meltzer, PCWang, PBlundell, PMadras, BK Synthesis and evaluation of dopamine and serotonin transporter inhibition by oxacyclic and carbacyclic analogues of methylphenidate. J Med Chem 46:1538-45 (2003)  
Target
Name:
Sodium-dependent dopamine transporter
Synonyms:
DA transporter DAT1 Dopamine transporter protein (DAT) SC6A3_HUMAN Sodium-dependent dopamine transporter Solute carrier family 6 member 3
Type:
Multi-pass membrane protein
Mol. Mass.:
68497.11
Organism:
Homo sapiens (Human)
Description:
Q01959
Residue:
620
  
Inhibitor
Name:
BDBM50062912
Synonyms:
CHEMBL796 alpha-phenyl-2-piperidineacetic acid methyl ester methyl alpha-phenyl-alpha-2-piperidinylacetate methyl phenyl(piperidin-2-yl)acetate | methylphenidan
Type:
Small organic molecule
Emp. Form.:
C14H19NO2
Mol. Mass.:
233.3062
SMILES:
COC(=O)C(C1CCCCN1)c1ccccc1
: