Target
Dihydrofolate reductase
Ligand
BDBM18224
Substrate
Meas. Tech.
ChEMBL_52970 (CHEMBL664178)
IC50
13±n/a nM
Citation
 Rosowsky, AForsch, RAQueener, SF Further studies on 2,4-diamino-5-(2',5'-disubstituted benzyl)pyrimidines as potent and selective inhibitors of dihydrofolate reductases from three major opportunistic pathogens of AIDS. J Med Chem 46:1726-36 (2003)  
Target
Name:
Dihydrofolate reductase
Synonyms:
DYR_PNECA Dihydrofolate reductase Tetrahydrofolate dehydrogenase
Type:
Enzyme
Mol. Mass.:
23891.29
Organism:
Pneumocystis carinii
Description:
Residue:
206
  
Inhibitor
Name:
BDBM18224
Synonyms:
6-[(2,5-dimethoxyphenyl)methyl]-5-methylpyrido[2,3-d]pyrimidine-2,4-diamine PTX [2-amino-6-(2,5-dimethoxybenzyl)-5-methyl-pyrido[2,3-d]pyrimidin-4-yl]amine;2-hydroxyethanesulfonic acid
Type:
Small organic molecule
Emp. Form.:
C17H19N5O2
Mol. Mass.:
325.3651
SMILES:
COc1ccc(OC)c(Cc2cnc3nc(N)nc(N)c3c2C)c1
: