Target
Tyrosine-protein phosphatase non-receptor type 1
Ligand
BDBM48319
Substrate
Meas. Tech.
ChEMBL_162274 (CHEMBL770822)
Kd
1200000±n/a nM
Citation
 Liu, GXin, ZLiang, HAbad-Zapatero, CHajduk, PJJanowick, DASzczepankiewicz, BGPei, ZHutchins, CWBallaron, SJStashko, MALubben, THBerg, CERondinone, CMTrevillyan, JMJirousek, MR Selective protein tyrosine phosphatase 1B inhibitors: targeting the second phosphotyrosine binding site with non-carboxylic acid-containing ligands. J Med Chem 46:3437-40 (2003)  
Target
Name:
Tyrosine-protein phosphatase non-receptor type 1
Synonyms:
PTN1_HUMAN PTPN1 Protein tyrosine phosphatase-1B (PTP1B) Protein-tyrosine phosphatase 1B (PTP1B) Tyrosine-protein phosphatase non-receptor type 1 (PTP1B)
Type:
Protein phosphatase
Mol. Mass.:
49963.76
Organism:
Homo sapiens (Human)
Description:
Human recombinant GST-fusion PTP1B (1-435).
Residue:
435
  
Inhibitor
Name:
BDBM48319
Synonyms:
4-amino-2-hydroxy-benzoic acid 4-azanyl-2-oxidanyl-benzoic acid ISONICOTINIC ACID HYDRAZIDE P-AMINOSALICYLATE SALT P-AMINOSALICYLIC ACID SMR000058830 | cid_11988145
Type:
Small organic molecule
Emp. Form.:
C7H7NO3
Mol. Mass.:
153.1354
SMILES:
Nc1ccc(C(O)=O)c(O)c1
: