Target
Retinoic acid receptor RXR-alpha
Ligand
BDBM50132579
Substrate
Meas. Tech.
ChEMBL_196770 (CHEMBL798931)
Ki
3.8±n/a nM
Citation
 Gernert, DLAjamie, RArdecky, RABell, MGLeibowitz, MDMais, DAMapes, CMMichellys, PYRungta, DReifel-Miller, ATyhonas, JSYumibe, NGrese, TA Design and synthesis of fluorinated RXR modulators. Bioorg Med Chem Lett 13:3191-5 (2003)  
Target
Name:
Retinoic acid receptor RXR-alpha
Synonyms:
NR2B1 Nuclear receptor subfamily 4 group A member 2 RXRA Retinoic acid receptor RXR-alpha/gamma Retinoid receptor
Type:
PROTEIN
Mol. Mass.:
50820.38
Organism:
Homo sapiens (Human)
Description:
ChEMBL_1456363
Residue:
462
  
Inhibitor
Name:
BDBM50132579
Synonyms:
(2E,4E,6Z)-7-(2-Butoxy-3,5-di-tert-butyl-phenyl)-3-methyl-octa-2,4,6-trienoic acid | CHEMBL110195
Type:
Small organic molecule
Emp. Form.:
C27H40O3
Mol. Mass.:
412.6047
SMILES:
CCCCOc1c(cc(cc1C(C)(C)C)C(C)(C)C)C(\C)=C/C=C/C(/C)=C/C(O)=O
: