Target
3-dehydroquinate dehydratase
Ligand
BDBM50137056
Substrate
Meas. Tech.
ChEMBL_213120 (CHEMBL818199)
Ki
100000±n/a nM
Citation
 González-Bello, CLence, EToscano, MDCastedo, LCoggins, JRAbell, C Parallel solid-phase synthesis and evaluation of inhibitors of Streptomyces coelicolor type II dehydroquinase. J Med Chem 46:5735-44 (2003)  
Target
Name:
3-dehydroquinate dehydratase
Synonyms:
AROQ_STRCO | aroQ
Type:
PROTEIN
Mol. Mass.:
16681.13
Organism:
Streptomyces coelicolor
Description:
ChEMBL_332877
Residue:
157
  
Inhibitor
Name:
BDBM50137056
Synonyms:
4-((1R,4R,6R)-4-Carboxy-4,6-dihydroxy-cyclohex-2-enyloxymethyl)-benzoic acid | CHEMBL153212
Type:
Small organic molecule
Emp. Form.:
C15H16O7
Mol. Mass.:
308.2833
SMILES:
O[C@@H]1C[C@@](O)(C=C[C@H]1OCc1ccc(cc1)C(O)=O)C(O)=O
: