Target
Melatonin receptor type 1B
Ligand
BDBM50452032
Substrate
Meas. Tech.
ChEBML_105264
Ki
0.440000±n/a nM
Citation
 Sun, LQChen, JTakaki, KJohnson, GIben, LMahle, CDRyan, EXu, C Design and synthesis of benzoxazole derivatives as novel melatoninergic ligands. Bioorg Med Chem Lett 14:1197-200 (2004)  
Target
Name:
Melatonin receptor type 1B
Synonyms:
MTNR1B Mel-1B-R Melatonin 1B Melatonin receptor type 1B | Melatonin receptor type 2 (MT2)
Type:
Enzyme
Mol. Mass.:
40203.54
Organism:
Homo sapiens (Human)
Description:
P49286
Residue:
362
  
Inhibitor
Name:
BDBM50452032
Synonyms:
CHEMBL2112727
Type:
Small organic molecule
Emp. Form.:
C16H20N2O2
Mol. Mass.:
272.3422
SMILES:
CCC(=O)NC[C@@H]1C[C@H]1c1cccc2nc(CC)oc12
: