Target
1-acyl-sn-glycerol-3-phosphate acyltransferase beta
Ligand
BDBM50141258
Substrate
Meas. Tech.
ChEBML_100169
IC50
60±n/a nM
Citation
 Gong, BHong, FKohm, CBonham, LKlein, P Synthesis and SAR of 2-arylbenzoxazoles, benzothiazoles and benzimidazoles as inhibitors of lysophosphatidic acid acyltransferase-beta. Bioorg Med Chem Lett 14:1455-9 (2004)  
Target
Name:
1-acyl-sn-glycerol-3-phosphate acyltransferase beta
Synonyms:
1-acylglycerol-3-phosphate O-acyltransferase beta PLCB_HUMAN
Type:
PROTEIN
Mol. Mass.:
30924.09
Organism:
Homo sapiens (Human)
Description:
ChEMBL_321473
Residue:
278
  
Inhibitor
Name:
BDBM50141258
Synonyms:
CHEMBL418604 | [4-Chloro-3-(5-chloro-1-methyl-1H-benzoimidazol-2-yl)-phenyl]-carbamic acid prop-2-ynyl ester
Type:
Small organic molecule
Emp. Form.:
C18H13Cl2N3O2
Mol. Mass.:
374.221
SMILES:
Cn1c(nc2cc(Cl)ccc12)-c1cc(NC(=O)OCC#C)ccc1Cl
: