Target
1-acyl-sn-glycerol-3-phosphate acyltransferase beta
Ligand
BDBM50141269
Substrate
Meas. Tech.
ChEBML_100169
IC50
40±n/a nM
Citation
 Gong, BHong, FKohm, CBonham, LKlein, P Synthesis and SAR of 2-arylbenzoxazoles, benzothiazoles and benzimidazoles as inhibitors of lysophosphatidic acid acyltransferase-beta. Bioorg Med Chem Lett 14:1455-9 (2004)  
Target
Name:
1-acyl-sn-glycerol-3-phosphate acyltransferase beta
Synonyms:
1-acylglycerol-3-phosphate O-acyltransferase beta PLCB_HUMAN
Type:
PROTEIN
Mol. Mass.:
30924.09
Organism:
Homo sapiens (Human)
Description:
ChEMBL_321473
Residue:
278
  
Inhibitor
Name:
BDBM50141269
Synonyms:
CHEMBL284111 | [4-Chloro-3-(5-chloro-benzothiazol-2-yl)-phenyl]-carbamic acid methyl ester
Type:
Small organic molecule
Emp. Form.:
C15H10Cl2N2O2S
Mol. Mass.:
353.223
SMILES:
COC(=O)Nc1ccc(Cl)c(c1)-c1nc2cc(Cl)ccc2s1
: