Target
Retinoic acid receptor RXR-beta
Ligand
BDBM50141592
Substrate
Meas. Tech.
ChEBML_197088
Ki
33±n/a nM
Citation
 Michellys, PYD'Arrigo, JGrese, TAKaranewsky, DSLeibowitz, MDMais, DAMapes, CMReifel-Miller, ARungta, DBoehm, MF Design, synthesis and structure-activity relationship of novel RXR-selective modulators. Bioorg Med Chem Lett 14:1593-8 (2004)  
Target
Name:
Retinoic acid receptor RXR-beta
Synonyms:
NR2B2 RXRB Retinoic acid receptor RXR-beta Retinoid receptor
Type:
PROTEIN
Mol. Mass.:
56932.89
Organism:
Homo sapiens (Human)
Description:
ChEMBL_39045
Residue:
533
  
Inhibitor
Name:
BDBM50141592
Synonyms:
(E)-3-[4-(3,5-Di-tert-butyl-2-methyl-phenyl)-benzo[b]thiophen-2-yl]-but-2-enoic acid | CHEMBL44420
Type:
Small organic molecule
Emp. Form.:
C27H32O2S
Mol. Mass.:
420.607
SMILES:
C\C(=C/C(O)=O)c1cc2c(cccc2s1)-c1cc(cc(c1C)C(C)(C)C)C(C)(C)C
: